<?xml version="1.0" ?>
<robot xmlns:xacro="http://www.ros.org/wiki/xacro" name="detector_camera">
    <link name="world">
        <origin xyz="0.0 0.0 0.0" />
    </link>
    <link name="detector_camera_base_link"></link>

    <joint name="detector_camera_world_jnt" type="fixed">
        <parent link="world" />
        <child link="detector_camera_base_link" />
    </joint>

    <joint name="detector_camera_joint" type="fixed">
        <parent link="detector_camera_base_link" />
        <child link="detector_camera_link" />
        <axis xyz="0 1 0" />
        <origin xyz="0.5 1.0 1.5" rpy="0.0 0.0 4.71239" />
    </joint>

    <link name="detector_camera_link">
        <collision>
            <origin xyz="0 0 0" rpy="0 0 0" />
            <geometry>
                <box size="0.05 0.2 0.05" />
            </geometry>
        </collision>

        <visual>
            <origin xyz="0 0 0" rpy="0 0 0" />
            <geometry>
                <box size="0.05 0.2 0.05" />
            </geometry>
            <material name="camera_white">
                <color rgba="1.0 1.0 1.0 1.0" />
            </material>
        </visual>

        <inertial>
            <mass value="0.1" />
            <origin xyz="0 0 0" rpy="0 0 0" />
            <inertia ixx="0.001" ixy="0" ixz="0" iyy="0.001" iyz="0" izz="0.001" />
        </inertial>
    </link>

    <gazebo reference="detector_camera_link">
        <sensor type="camera" name="detector_camera_sensor">
            <camera name="head">
                <horizontal_fov>0.4</horizontal_fov>
                <image>
                    <width>1000</width>
                    <height>1000</height>
                    <format>R8G8B8</format>
                </image>
                <clip>
                    <near>0.02</near>
                    <far>300</far>
                </clip>
                <noise>
                    <type>gaussian</type>
                    <mean>0.0</mean>
                    <stddev>0.007</stddev>
                </noise>
            </camera>
            <plugin name="camera_controller" filename="libgazebo_ros_camera.so">
                <alwaysOn>true</alwaysOn>
                <updateRate>30.0</updateRate>
                <cameraName>color</cameraName>
                <frameName>image_plane</frameName>
                <imageTopicName>image_raw</imageTopicName>
                <cameraInfoTopicName>camera_info</cameraInfoTopicName>
                <hackBaseline>0.07</hackBaseline>
                <distortionK1>0.0</distortionK1>
                <distortionK2>0.0</distortionK2>
                <distortionK3>0.0</distortionK3>
                <distortionT1>0.0</distortionT1>
                <distortionT2>0.0</distortionT2>
            </plugin>
        </sensor>
    </gazebo>
</robot>