[
    {
        "ruleId": 2,
        "ruleDefinitionLink": "query_repos/speed_correspondence_link_check.sparql",
        "models": [
            {
                "view": "cad",
                "element name": "BeltConveyor4",
                "property": "length",
                "Value": 100.0
            },
            {
                "view": "simulation",
                "element name": "BeltConveyor4",
                "property": "travelTime",
                "Value": 4.0
            },
            {
                "view": "plc",
                "element name": "BeltConveyor4",
                "property": "Speed_rotational",
                "Value": 50.318
            }
        ],
        "message": "WARNING: length, transport time and velocity do not match"
    },
    {
        "ruleId": 2,
        "ruleDefinitionLink": "query_repos/speed_correspondence_link_check.sparql",
        "models": [
            {
                "view": "cad",
                "element name": "BeltConveyor1",
                "property": "length",
                "Value": 100.0
            },
            {
                "view": "simulation",
                "element name": "BeltConveyor1",
                "property": "travelTime",
                "Value": 4.0
            },
            {
                "view": "plc",
                "element name": "BeltConveyor1",
                "property": "Speed_rotational",
                "Value": 50.318
            }
        ],
        "message": "WARNING: length, transport time and velocity do not match"
    },
    {
        "ruleId": 2,
        "ruleDefinitionLink": "query_repos/speed_correspondence_link_check.sparql",
        "models": [
            {
                "view": "cad",
                "element name": "BeltConveyor2",
                "property": "length",
                "Value": 100.0
            },
            {
                "view": "simulation",
                "element name": "BeltConveyor2",
                "property": "travelTime",
                "Value": 4.0
            },
            {
                "view": "plc",
                "element name": "BeltConveyor2",
                "property": "Speed_rotational",
                "Value": 26.6
            }
        ],
        "message": "WARNING: length, transport time and velocity do not match"
    },
    {
        "ruleId": 2,
        "ruleDefinitionLink": "query_repos/speed_correspondence_link_check.sparql",
        "models": [
            {
                "view": "cad",
                "element name": "BeltConveyor3",
                "property": "length",
                "Value": 100.0
            },
            {
                "view": "simulation",
                "element name": "BeltConveyor3",
                "property": "travelTime",
                "Value": 4.0
            },
            {
                "view": "plc",
                "element name": "BeltConveyor3",
                "property": "Speed_rotational",
                "Value": 50.318
            }
        ],
        "message": "WARNING: length, transport time and velocity do not match"
    },
    {
        "ruleId": 3,
        "ruleDefinitionLink": "query_repos/speed_taxonomy_check.sparql",
        "models": [
            {
                "view": "plc",
                "element name": "plc_BeltConveyor1_Speed_rotational",
                "property": "Speed_rotational",
                "Value": 50.318
            }
        ],
        "message": "WARNING: Velocity does not satisfy the taxonomy"
    },
    {
        "ruleId": 3,
        "ruleDefinitionLink": "query_repos/speed_taxonomy_check.sparql",
        "models": [
            {
                "view": "plc",
                "element name": "plc_BeltConveyor2_Speed_rotational",
                "property": "Speed_rotational",
                "Value": 26.6
            }
        ],
        "message": "WARNING: Velocity does not satisfy the taxonomy"
    },
    {
        "ruleId": 3,
        "ruleDefinitionLink": "query_repos/speed_taxonomy_check.sparql",
        "models": [
            {
                "view": "plc",
                "element name": "plc_BeltConveyor3_Speed_rotational",
                "property": "Speed_rotational",
                "Value": 50.318
            }
        ],
        "message": "WARNING: Velocity does not satisfy the taxonomy"
    },
    {
        "ruleId": 3,
        "ruleDefinitionLink": "query_repos/speed_taxonomy_check.sparql",
        "models": [
            {
                "view": "plc",
                "element name": "plc_BeltConveyor4_Speed_rotational",
                "property": "Speed_rotational",
                "Value": 50.318
            }
        ],
        "message": "WARNING: Velocity does not satisfy the taxonomy"
    }
]