,ce_one_hot,ce_distr,ece,mce,sce
0,1.0128976106643677,1.177832841873169,0.03534891098801922,0.11929019154334553,0.013233365846848782
1,1.0375982522964478,1.1911455392837524,0.03838794048393562,0.15813931822776794,0.013198120968113958
2,1.0633816719055176,1.1973800659179688,0.022647090623502942,0.22185343929699491,0.013511557636195716
3,0.9688296318054199,1.158296823501587,0.040269645481655895,0.10544377718216336,0.012761935317078655
4,1.0169318914413452,1.1863025426864624,0.02332715946388341,0.08842341767417061,0.013325955132702464
5,0.9638015627861023,1.120201587677002,0.02812675669073622,0.09382756916681928,0.014174357505132438
6,0.9884923696517944,1.1400034427642822,0.031666418405075274,0.19040992856025696,0.012170212196091752
7,1.0777019262313843,1.246369481086731,0.050974568833402616,0.14341361651549467,0.01665093842873291
8,1.1591914892196655,1.2413464784622192,0.07977719427273008,0.3345190125091053,0.016638068562262753
9,0.8236002922058105,1.0798765420913696,0.020912903545020935,0.07217428011771959,0.012127050670563213
10,0.9999512434005737,1.1115480661392212,0.037332778256242545,0.1582312434911728,0.01707267789888466
11,0.9017840027809143,1.0083810091018677,0.06307842043238952,0.14086247233640758,0.016636706011235958
12,0.9338983297348022,1.0421106815338135,0.04177595371529865,0.14570285876591998,0.015024875859756382
13,0.9440937638282776,1.0320223569869995,0.028203649739774368,0.18760505318641663,0.014863858835911185
14,0.9563268423080444,1.0620014667510986,0.046602636722992044,0.14638278385003406,0.015780400613565334
15,0.8614330887794495,1.016123652458191,0.08293825432709181,0.18855488300323486,0.018319225948933305
16,0.9064774513244629,1.0112814903259277,0.03572913867041059,0.1897565722465515,0.015584006995663173
17,0.9209163188934326,1.0330837965011597,0.0322623864248699,0.09361590657915386,0.015613837843527708
18,1.055263876914978,1.1397027969360352,0.06257693094870932,0.14423831303914386,0.018081109025483086
19,1.0500746965408325,1.1399056911468506,0.08283818406178584,0.1565650952206622,0.018460970641428914
