\begin{tikzpicture}

\tikzset{LineStyle/.style={thick, line cap=round, line join=round}}

\def\unit{0.05*478pt}
\coordinate (U) at ({\unit}, 0);
\coordinate (V) at ({0.2*\unit}, {0.75*\unit});

\fill[gray!15] (0, 0) -- ++($8*(V)$) -- ++($8*(U)$) -- ++($-8*(V)$) -- ++($-8*(U)$) -- cycle;

\foreach \IX/\IY/\JX/\JY in {0/0/0/8, 4/0/4/8, 8/0/8/8, 0/0/8/0, 0/4/8/4, 0/8/8/8, 0/2/4/2, 
                             0/6/8/6, 2/0/2/8, 6/4/6/8, 2/3/4/3, 2/5/6/5, 3/2/3/6, 5/4/5/6}
    \draw[LineStyle] ($\IX*(U) + \IY*(V)$) -- ($\JX*(U) + \JY*(V)$);

\foreach [count=\i from 0] \X/\Y in {6.0/2.0, 1.0/1.0, 1.0/3.0, 3.0/1.0, 1.0/5.0, 1.0/7.0, 3.0/7.0, 5.0/7.0, 
                                     7.0/5.0, 7.0/7.0, 2.5/2.5, 2.5/3.5, 3.5/2.5, 3.5/3.5, 2.5/4.5, 2.5/5.5, 
                                     3.5/4.5, 3.5/5.5, 4.5/4.5, 4.5/5.5, 5.5/4.5, 5.5/5.5}
{
    \node at ($\X*(U) + \Y*(V)$) {\i};
}

\end{tikzpicture}
