\tikzset{ghostcellstyle/.style={semithick, black!35!}}
\tikzset{slabinterfacestyle/.style={thick, lightblue}}
\tikzset{basegridstyle/.style={thick, black}}
\tikzset{refinedgridstyle/.style={semithick, black}}

\begin{tikzpicture}[scale=5.3]

  % Horizontal lines  
  \foreach \y/\xA/\xB in {9/8/14, 10/8/16, 11/8/16, 12/8/24, 
                          13/10/18, 14/8/20, 15/12/18}
  {
      \draw[ghostcellstyle] (\xA/8, \y/8) -- (\xB/8, \y/8);
  }
    
  \foreach \y/\xA/\xB in {17/12/20, 18/12/20, 19/14/20, 20/8/24, 
                          21/14/22, 22/12/24, 23/16/24, 24/0/24}
  {
      \draw[refinedgridstyle] (\xA/8, \y/8) -- (\xB/8, \y/8);
  }
    
    
  % Vertical lines
  \foreach \x/\yA/\yB in {8/8/16, 9/8/12, 10/8/16, 11/8/14, 12/8/16, 
                          13/8/16, 14/8/16, 15/10/16, 16/8/16,
                          17/12/16, 18/12/16, 20/8/16, 24/8/16}
  {
      \draw[ghostcellstyle] (\x/8, \yA/8) -- (\x/8, \yB/8);
  }
        
  \foreach \x/\yA/\yB in {8/16/24, 12/16/24, 13/16/18, 14/16/24, 
                          15/16/22, 16/16/24, 17/16/24, 18/16/24, 
                          19/16/24, 20/16/24, 21/20/24, 22/20/24, 
                          23/22/24, 24/16/24}
  {
      \draw[refinedgridstyle] (\x/8, \yA/8) -- (\x/8, \yB/8);
  }
   
  % Horizontal base mesh lines
  \draw[basegridstyle] (0, 3) -- (3, 3);
  \draw[ghostcellstyle] (0, 1) -- (3, 1);
  \draw[slabinterfacestyle] (0, 2) -- (3, 2);
   
  % Draw axis and label
  \draw[thick, black, ->] (0,0) -- (3.15,0) node[below] {$x$}; 
  \draw[thick, black, ->] (0,0) -- (0,3.15) node[left] {$t$};
    
  % Laser path  
  \draw[very thick, red] (0.84, 0 ) -- (2.7, 3);
  \draw[very thick, dashed, nicegreen] (0.45, 0 ) -- (2.31, 3);
  \draw[very thick, dashed, nicegreen] (0.94, 0 ) -- (2.8, 3);
  
\end{tikzpicture}
