\begin{tikzpicture}

\node[below right, inner sep=0pt] (P) at (0,0) {\includegraphics[height=0.33\linewidth]{\picsDir/hatched_square_1_2168_melt_pool.jpg}};

\begin{scope}[x={($1/280*(P.north east)$)},
              y={($1/400*(P.south west)$)}]
            
\coordinate (FrontBottomLeft) at (15, 393);
\coordinate (FrontBottomRight) at (174, 393);
\coordinate (BackBottomRight) at (250, 42);
\coordinate (FrontTopRight) at (167, 358);

\node[below, inner sep=0pt, yshift=-0.2cm] at ($(FrontBottomRight)!0.5!(FrontBottomLeft)$){\SI{141}{\micro\meter}};
\node[right, inner sep=0pt, xshift=0.1cm] at ($(FrontBottomRight)!0.5!(BackBottomRight)$){\SI{435}{\micro\meter}};
\node[right, inner sep=0pt, xshift=0.2cm] at ($(FrontBottomRight)!0.5!(FrontTopRight)$){\SI{40.3}{\micro\meter}};

\end{scope}

\end{tikzpicture}