\begin{tikzpicture}
    \begin{semilogyaxis}[         
        ylabel={$|| u - u^h ||_{E} \, / \, || u ||_{E} \cdot 100\%$}, %||_{L^2} \, / \, || u ||_{L^2} \cdot 100\%$},
        xlabel={$\sqrt[4]{N}$},
        legend pos=north east,
        yminorticks=false,
        xminorticks=false,
        cycle list name=convergenceColorList,
        %mark size=1.7pt,
        %xmax=1e9, 
        %ymin=1e-11,
        legend cell align={left}
        ]
    
        \addlegendentry{uniform tensor};
        \addplot table[ x expr=\thisrowno{1}^(1/4), y expr=\thisrowno{3}*100, skip coords between index={14}{15} ] {\picsDir/04_singular_3D_uniform_tensor.dat};
        
        \addlegendentry{graded trunk};
        \addplot table[ x expr=\thisrowno{1}^(1/4), y expr=\thisrowno{3}*100, skip coords between index={20}{21} ] {\picsDir/04_singular_3D_graded_trunc.dat};

    \end{semilogyaxis}
\end{tikzpicture} 
