\begin{tikzpicture}

%\draw[->] (-1.2,0) -- (1.2,0) node[right] {$x$};
%\draw[->] (0,-0.8) -- (0,1.2) node[above] {$y$};

\begin{scope}[yshift=6cm]
    \node[anchor=east] at (-1.5, 0.1) {Basis for $p = 1$:};
    
    \draw[|-|] (-1, 0) -- (1, 0);
    \draw[|-|] (1.5, 0) -- (3.5, 0);

    \draw[thick, domain=-1:1,smooth,variable=\x]  plot ({\x},{0.5 - 0.5*\x});
    \draw[thick, domain=-1:1,smooth,variable=\x] plot ({\x + 2.5},{0.5 + 0.5*\x});
\end{scope}

\begin{scope}[yshift=4cm]
    \node[anchor=east] at (-1.5, 0.1) {Basis for $p = 2$:};
    
    \draw[|-|] (-1, 0) -- (1, 0);
    \draw[|-|] (1.5, 0) -- (3.5, 0);
    \draw[|-|] (4, 0) -- (6, 0);

    \draw[thick, domain=-1:1,smooth,variable=\x]  plot ({\x},{0.5 - 0.5*\x});
    \draw[thick, domain=-1:1,smooth,variable=\x] plot ({\x + 2.5},{0.5 + 0.5*\x});
    \draw[thick, domain=-1:1,smooth,variable=\x]  plot ({\x + 5.0},{0.61*(\x*\x - 1.0)});
\end{scope}

\begin{scope}[yshift=2cm]
    \node[anchor=east] at (-1.5, 0.1) {Basis for $p = 3$:};
    
    \draw[|-|] (-1, 0) -- (1, 0);
    \draw[|-|] (1.5, 0) -- (3.5, 0);
    \draw[|-|] (4, 0) -- (6, 0);
    \draw[|-|] (6.5, 0) -- (8.5, 0);

    \draw[thick, domain=-1:1,smooth,variable=\x]  plot ({\x},{0.5 - 0.5*\x});
    \draw[thick, domain=-1:1,smooth,variable=\x] plot ({\x + 2.5},{0.5 + 0.5*\x});
    \draw[thick, domain=-1:1,smooth,variable=\x]  plot ({\x + 5.0},{0.61*(\x*\x - 1.0)});
    \draw[thick, domain=-1:1,smooth,variable=\x]  plot ({\x + 7.5},{0.79*(\x*\x - 1.0)*\x});
\end{scope}
      
%\begin{scope}[yshift=0cm]
%    \node[anchor=east] at (-1.5, 0.1) {Inconsistent ordering:};
%    
%    \draw[|-|] (-1, 0) -- (1, 0);
%    \draw[|-|] (1.5, 0) -- (3.5, 0);
%    \draw[|-|] (4, 0) -- (6, 0);
%    \draw[|-|] (6.5, 0) -- (8.5, 0);
%
%    \draw[thick, domain=-1:1,smooth,variable=\x]  plot ({\x},{0.5 - 0.5*\x});
%    \draw[thick, domain=-1:1,smooth,variable=\x] plot ({\x + 7.5},{0.5 + 0.5*\x});
%    \draw[thick, domain=-1:1,smooth,variable=\x]  plot ({\x + 5.0},{0.61*(\x*\x - 1.0)});
%    \draw[thick, domain=-1:1,smooth,variable=\x]  plot ({\x + 2.5},{0.79*(\x*\x - 1.0)*\x});
%\end{scope}
      
\end{tikzpicture}

