N,m,b,history,selection_coefficient,dominance_coefficient,nb_simulations
200,30,0.5,1,0.2,0.5,4
200,30,0.5,1,0.2,0.5,4
200,30,0.5,0,0.2,0.5,4
200,30,0.5,1,0.2,0.5,4
200,30,0.5,0,0.2,0.5,4
200,30,0.5,1,0.2,0.5,4
200,30,0.5,0,0.2,0.5,4
200,30,0.5,1,0.2,0.5,4
200,30,0.5,2,0.2,0.5,4
200,30,0.5,3,0.2,0.5,4
200,30,0.5,2,0.2,0.5,4
200,30,0.5,4,0.2,0.5,4
200,30,0.5,4,0.2,0.5,4
200,30,0.5,2,0.2,0.5,4
200,30,0.5,1,0.2,0.5,4
200,30,0.5,0,0.2,0.5,4
200,30,0.5,1,0.2,0.5,4
200,30,0.5,2,0.2,0.5,4
200,30,0.5,2,0.2,0.5,4
200,30,0.5,2,0.2,0.5,4
200,30,0.5,5,0.2,0.5,4
200,30,0.5,1,0.2,0.5,4
200,30,0.5,3,0.2,0.5,4
200,30,0.5,3,0.2,0.5,4
200,30,0.5,5,0.2,0.5,4
200,30,0.5,5,0.2,0.5,4
200,30,0.5,7,0.2,0.5,4
200,30,0.5,7,0.2,0.5,4
200,30,0.5,7,0.2,0.5,4
200,30,0.5,9,0.2,0.5,4
200,30,0.5,5,0.2,0.5,4
200,30,0.5,7,0.2,0.5,4
200,30,0.5,8,0.2,0.5,4
200,30,0.5,12,0.2,0.5,4
200,30,0.5,13,0.2,0.5,4
200,30,0.5,10,0.2,0.5,4
200,30,0.5,8,0.2,0.5,4
200,30,0.5,10,0.2,0.5,4
200,30,0.5,10,0.2,0.5,4
200,30,0.5,11,0.2,0.5,4
200,30,0.5,18,0.2,0.5,4
200,30,0.5,18,0.2,0.5,4
200,30,0.5,14,0.2,0.5,4
200,30,0.5,19,0.2,0.5,4
200,30,0.5,13,0.2,0.5,4
200,30,0.5,18,0.2,0.5,4
200,30,0.5,15,0.2,0.5,4
200,30,0.5,21,0.2,0.5,4
200,30,0.5,25,0.2,0.5,4
200,30,0.5,16,0.2,0.5,4
200,30,0.5,21,0.2,0.5,4
200,30,0.5,29,0.2,0.5,4
200,30,0.5,17,0.2,0.5,4
200,30,0.5,12,0.2,0.5,4
200,30,0.5,16,0.2,0.5,4
200,30,0.5,19,0.2,0.5,4
200,30,0.5,14,0.2,0.5,4
200,30,0.5,18,0.2,0.5,4
200,30,0.5,13,0.2,0.5,4
200,30,0.5,20,0.2,0.5,4
200,30,0.5,30,0.2,0.5,4
200,30,0.5,35,0.2,0.5,4
200,30,0.5,40,0.2,0.5,4
200,30,0.5,41,0.2,0.5,4
200,30,0.5,40,0.2,0.5,4
200,30,0.5,54,0.2,0.5,4
200,30,0.5,43,0.2,0.5,4
200,30,0.5,44,0.2,0.5,4
200,30,0.5,40,0.2,0.5,4
200,30,0.5,51,0.2,0.5,4
200,30,0.5,45,0.2,0.5,4
200,30,0.5,41,0.2,0.5,4
200,30,0.5,44,0.2,0.5,4
200,30,0.5,40,0.2,0.5,4
200,30,0.5,41,0.2,0.5,4
200,30,0.5,41,0.2,0.5,4
200,30,0.5,40,0.2,0.5,4
200,30,0.5,40,0.2,0.5,4
200,30,0.5,36,0.2,0.5,4
200,30,0.5,46,0.2,0.5,4
200,30,0.5,39,0.2,0.5,4
200,30,0.5,33,0.2,0.5,4
200,30,0.5,43,0.2,0.5,4
200,30,0.5,42,0.2,0.5,4
200,30,0.5,59,0.2,0.5,4
200,30,0.5,66,0.2,0.5,4
200,30,0.5,64,0.2,0.5,4
200,30,0.5,64,0.2,0.5,4
200,30,0.5,76,0.2,0.5,4
200,30,0.5,85,0.2,0.5,4
200,30,0.5,89,0.2,0.5,4
200,30,0.5,80,0.2,0.5,4
200,30,0.5,93,0.2,0.5,4
200,30,0.5,91,0.2,0.5,4
200,30,0.5,99,0.2,0.5,4
200,30,0.5,93,0.2,0.5,4
200,30,0.5,105,0.2,0.5,4
200,30,0.5,92,0.2,0.5,4
200,30,0.5,98,0.2,0.5,4
200,30,0.5,105,0.2,0.5,4
200,30,0.5,112,0.2,0.5,4
200,30,0.5,123,0.2,0.5,4
200,30,0.5,113,0.2,0.5,4
200,30,0.5,122,0.2,0.5,4
200,30,0.5,114,0.2,0.5,4
200,30,0.5,125,0.2,0.5,4
200,30,0.5,133,0.2,0.5,4
200,30,0.5,134,0.2,0.5,4
200,30,0.5,146,0.2,0.5,4
200,30,0.5,136,0.2,0.5,4
200,30,0.5,152,0.2,0.5,4
200,30,0.5,139,0.2,0.5,4
200,30,0.5,160,0.2,0.5,4
200,30,0.5,161,0.2,0.5,4
200,30,0.5,176,0.2,0.5,4
200,30,0.5,176,0.2,0.5,4
200,30,0.5,166,0.2,0.5,4
200,30,0.5,174,0.2,0.5,4
200,30,0.5,168,0.2,0.5,4
200,30,0.5,191,0.2,0.5,4
200,30,0.5,201,0.2,0.5,4
200,30,0.5,197,0.2,0.5,4
200,30,0.5,201,0.2,0.5,4
200,30,0.5,220,0.2,0.5,4
200,30,0.5,253,0.2,0.5,4
200,30,0.5,245,0.2,0.5,4
200,30,0.5,245,0.2,0.5,4
200,30,0.5,248,0.2,0.5,4
200,30,0.5,269,0.2,0.5,4
200,30,0.5,272,0.2,0.5,4
200,30,0.5,256,0.2,0.5,4
200,30,0.5,266,0.2,0.5,4
200,30,0.5,277,0.2,0.5,4
200,30,0.5,278,0.2,0.5,4
200,30,0.5,279,0.2,0.5,4
200,30,0.5,283,0.2,0.5,4
200,30,0.5,288,0.2,0.5,4
200,30,0.5,303,0.2,0.5,4
200,30,0.5,282,0.2,0.5,4
200,30,0.5,291,0.2,0.5,4
200,30,0.5,288,0.2,0.5,4
200,30,0.5,290,0.2,0.5,4
200,30,0.5,302,0.2,0.5,4
200,30,0.5,305,0.2,0.5,4
200,30,0.5,317,0.2,0.5,4
200,30,0.5,322,0.2,0.5,4
200,30,0.5,326,0.2,0.5,4
200,30,0.5,332,0.2,0.5,4
200,30,0.5,328,0.2,0.5,4
200,30,0.5,335,0.2,0.5,4
200,30,0.5,347,0.2,0.5,4
200,30,0.5,337,0.2,0.5,4
200,30,0.5,342,0.2,0.5,4
200,30,0.5,335,0.2,0.5,4
200,30,0.5,344,0.2,0.5,4
200,30,0.5,358,0.2,0.5,4
200,30,0.5,352,0.2,0.5,4
200,30,0.5,363,0.2,0.5,4
200,30,0.5,369,0.2,0.5,4
200,30,0.5,373,0.2,0.5,4
200,30,0.5,362,0.2,0.5,4
200,30,0.5,365,0.2,0.5,4
200,30,0.5,370,0.2,0.5,4
200,30,0.5,366,0.2,0.5,4
200,30,0.5,368,0.2,0.5,4
200,30,0.5,363,0.2,0.5,4
200,30,0.5,360,0.2,0.5,4
200,30,0.5,375,0.2,0.5,4
200,30,0.5,378,0.2,0.5,4
200,30,0.5,386,0.2,0.5,4
200,30,0.5,377,0.2,0.5,4
200,30,0.5,369,0.2,0.5,4
200,30,0.5,368,0.2,0.5,4
200,30,0.5,360,0.2,0.5,4
200,30,0.5,361,0.2,0.5,4
200,30,0.5,375,0.2,0.5,4
200,30,0.5,369,0.2,0.5,4
200,30,0.5,375,0.2,0.5,4
200,30,0.5,380,0.2,0.5,4
200,30,0.5,376,0.2,0.5,4
200,30,0.5,376,0.2,0.5,4
200,30,0.5,380,0.2,0.5,4
200,30,0.5,382,0.2,0.5,4
200,30,0.5,385,0.2,0.5,4
200,30,0.5,389,0.2,0.5,4
200,30,0.5,390,0.2,0.5,4
200,30,0.5,392,0.2,0.5,4
200,30,0.5,390,0.2,0.5,4
200,30,0.5,392,0.2,0.5,4
200,30,0.5,388,0.2,0.5,4
200,30,0.5,395,0.2,0.5,4
200,30,0.5,394,0.2,0.5,4
200,30,0.5,395,0.2,0.5,4
200,30,0.5,392,0.2,0.5,4
200,30,0.5,392,0.2,0.5,4
200,30,0.5,396,0.2,0.5,4
200,30,0.5,393,0.2,0.5,4
200,30,0.5,391,0.2,0.5,4
200,30,0.5,393,0.2,0.5,4
200,30,0.5,390,0.2,0.5,4
200,30,0.5,391,0.2,0.5,4
200,30,0.5,393,0.2,0.5,4
200,30,0.5,396,0.2,0.5,4
200,30,0.5,393,0.2,0.5,4
200,30,0.5,393,0.2,0.5,4
200,30,0.5,393,0.2,0.5,4
200,30,0.5,397,0.2,0.5,4
200,30,0.5,400,0.2,0.5,4
200,30,0.5,396,0.2,0.5,4
200,30,0.5,399,0.2,0.5,4
200,30,0.5,399,0.2,0.5,4
200,30,0.5,396,0.2,0.5,4
200,30,0.5,400,0.2,0.5,4
200,30,0.5,400,0.2,0.5,4
200,30,0.5,400,0.2,0.5,4
200,30,0.5,400,0.2,0.5,4
200,30,0.5,400,0.2,0.5,4
200,30,0.5,400,0.2,0.5,4
200,30,0.5,400,0.2,0.5,4
200,30,0.5,400,0.2,0.5,4
200,30,0.5,400,0.2,0.5,4
200,30,0.5,400,0.2,0.5,4
200,30,0.5,400,0.2,0.5,4
200,30,0.5,400,0.2,0.5,4
200,30,0.5,400,0.2,0.5,4
200,30,0.5,400,0.2,0.5,4
200,30,0.5,400,0.2,0.5,4
200,30,0.5,400,0.2,0.5,4
200,30,0.5,400,0.2,0.5,4
200,30,0.5,400,0.2,0.5,4
200,30,0.5,400,0.2,0.5,4
200,30,0.5,400,0.2,0.5,4
200,30,0.5,400,0.2,0.5,4
200,30,0.5,400,0.2,0.5,4
200,30,0.5,400,0.2,0.5,4
200,30,0.5,400,0.2,0.5,4
200,30,0.5,400,0.2,0.5,4
200,30,0.5,400,0.2,0.5,4
200,30,0.5,400,0.2,0.5,4
200,30,0.5,400,0.2,0.5,4
200,30,0.5,400,0.2,0.5,4
200,30,0.5,400,0.2,0.5,4
