N,m,b,history,selection_coefficient,dominance_coefficient,nb_simulations
200,30,0.5,1,0.2,0.5,4
200,30,0.5,0,0.2,0.5,4
200,30,0.5,0,0.2,0.5,4
200,30,0.5,1,0.2,0.5,4
200,30,0.5,2,0.2,0.5,4
200,30,0.5,2,0.2,0.5,4
200,30,0.5,1,0.2,0.5,4
200,30,0.5,2,0.2,0.5,4
200,30,0.5,4,0.2,0.5,4
200,30,0.5,4,0.2,0.5,4
200,30,0.5,4,0.2,0.5,4
200,30,0.5,7,0.2,0.5,4
200,30,0.5,9,0.2,0.5,4
200,30,0.5,13,0.2,0.5,4
200,30,0.5,10,0.2,0.5,4
200,30,0.5,12,0.2,0.5,4
200,30,0.5,13,0.2,0.5,4
200,30,0.5,10,0.2,0.5,4
200,30,0.5,13,0.2,0.5,4
200,30,0.5,13,0.2,0.5,4
200,30,0.5,7,0.2,0.5,4
200,30,0.5,10,0.2,0.5,4
200,30,0.5,9,0.2,0.5,4
200,30,0.5,9,0.2,0.5,4
200,30,0.5,5,0.2,0.5,4
200,30,0.5,10,0.2,0.5,4
200,30,0.5,11,0.2,0.5,4
200,30,0.5,8,0.2,0.5,4
200,30,0.5,8,0.2,0.5,4
200,30,0.5,8,0.2,0.5,4
200,30,0.5,7,0.2,0.5,4
200,30,0.5,5,0.2,0.5,4
200,30,0.5,4,0.2,0.5,4
200,30,0.5,2,0.2,0.5,4
200,30,0.5,2,0.2,0.5,4
200,30,0.5,6,0.2,0.5,4
200,30,0.5,4,0.2,0.5,4
200,30,0.5,3,0.2,0.5,4
200,30,0.5,4,0.2,0.5,4
200,30,0.5,7,0.2,0.5,4
200,30,0.5,9,0.2,0.5,4
200,30,0.5,8,0.2,0.5,4
200,30,0.5,8,0.2,0.5,4
200,30,0.5,15,0.2,0.5,4
200,30,0.5,9,0.2,0.5,4
200,30,0.5,18,0.2,0.5,4
200,30,0.5,13,0.2,0.5,4
200,30,0.5,17,0.2,0.5,4
200,30,0.5,13,0.2,0.5,4
200,30,0.5,19,0.2,0.5,4
200,30,0.5,15,0.2,0.5,4
200,30,0.5,15,0.2,0.5,4
200,30,0.5,24,0.2,0.5,4
200,30,0.5,26,0.2,0.5,4
200,30,0.5,23,0.2,0.5,4
200,30,0.5,25,0.2,0.5,4
200,30,0.5,27,0.2,0.5,4
200,30,0.5,23,0.2,0.5,4
200,30,0.5,19,0.2,0.5,4
200,30,0.5,26,0.2,0.5,4
200,30,0.5,26,0.2,0.5,4
200,30,0.5,33,0.2,0.5,4
200,30,0.5,37,0.2,0.5,4
200,30,0.5,22,0.2,0.5,4
200,30,0.5,30,0.2,0.5,4
200,30,0.5,31,0.2,0.5,4
200,30,0.5,29,0.2,0.5,4
200,30,0.5,36,0.2,0.5,4
200,30,0.5,35,0.2,0.5,4
200,30,0.5,35,0.2,0.5,4
200,30,0.5,36,0.2,0.5,4
200,30,0.5,42,0.2,0.5,4
200,30,0.5,33,0.2,0.5,4
200,30,0.5,38,0.2,0.5,4
200,30,0.5,38,0.2,0.5,4
200,30,0.5,54,0.2,0.5,4
200,30,0.5,46,0.2,0.5,4
200,30,0.5,57,0.2,0.5,4
200,30,0.5,57,0.2,0.5,4
200,30,0.5,50,0.2,0.5,4
200,30,0.5,42,0.2,0.5,4
200,30,0.5,45,0.2,0.5,4
200,30,0.5,53,0.2,0.5,4
200,30,0.5,50,0.2,0.5,4
200,30,0.5,68,0.2,0.5,4
200,30,0.5,73,0.2,0.5,4
200,30,0.5,73,0.2,0.5,4
200,30,0.5,78,0.2,0.5,4
200,30,0.5,74,0.2,0.5,4
200,30,0.5,79,0.2,0.5,4
200,30,0.5,71,0.2,0.5,4
200,30,0.5,91,0.2,0.5,4
200,30,0.5,87,0.2,0.5,4
200,30,0.5,92,0.2,0.5,4
200,30,0.5,106,0.2,0.5,4
200,30,0.5,119,0.2,0.5,4
200,30,0.5,120,0.2,0.5,4
200,30,0.5,139,0.2,0.5,4
200,30,0.5,120,0.2,0.5,4
200,30,0.5,132,0.2,0.5,4
200,30,0.5,130,0.2,0.5,4
200,30,0.5,130,0.2,0.5,4
200,30,0.5,143,0.2,0.5,4
200,30,0.5,167,0.2,0.5,4
200,30,0.5,151,0.2,0.5,4
200,30,0.5,156,0.2,0.5,4
200,30,0.5,174,0.2,0.5,4
200,30,0.5,187,0.2,0.5,4
200,30,0.5,210,0.2,0.5,4
200,30,0.5,190,0.2,0.5,4
200,30,0.5,175,0.2,0.5,4
200,30,0.5,196,0.2,0.5,4
200,30,0.5,185,0.2,0.5,4
200,30,0.5,193,0.2,0.5,4
200,30,0.5,208,0.2,0.5,4
200,30,0.5,206,0.2,0.5,4
200,30,0.5,202,0.2,0.5,4
200,30,0.5,223,0.2,0.5,4
200,30,0.5,228,0.2,0.5,4
200,30,0.5,217,0.2,0.5,4
200,30,0.5,238,0.2,0.5,4
200,30,0.5,229,0.2,0.5,4
200,30,0.5,225,0.2,0.5,4
200,30,0.5,247,0.2,0.5,4
200,30,0.5,252,0.2,0.5,4
200,30,0.5,261,0.2,0.5,4
200,30,0.5,259,0.2,0.5,4
200,30,0.5,249,0.2,0.5,4
200,30,0.5,274,0.2,0.5,4
200,30,0.5,269,0.2,0.5,4
200,30,0.5,292,0.2,0.5,4
200,30,0.5,293,0.2,0.5,4
200,30,0.5,296,0.2,0.5,4
200,30,0.5,292,0.2,0.5,4
200,30,0.5,302,0.2,0.5,4
200,30,0.5,306,0.2,0.5,4
200,30,0.5,309,0.2,0.5,4
200,30,0.5,298,0.2,0.5,4
200,30,0.5,295,0.2,0.5,4
200,30,0.5,302,0.2,0.5,4
200,30,0.5,303,0.2,0.5,4
200,30,0.5,297,0.2,0.5,4
200,30,0.5,315,0.2,0.5,4
200,30,0.5,312,0.2,0.5,4
200,30,0.5,321,0.2,0.5,4
200,30,0.5,323,0.2,0.5,4
200,30,0.5,321,0.2,0.5,4
200,30,0.5,328,0.2,0.5,4
200,30,0.5,321,0.2,0.5,4
200,30,0.5,348,0.2,0.5,4
200,30,0.5,343,0.2,0.5,4
200,30,0.5,353,0.2,0.5,4
200,30,0.5,352,0.2,0.5,4
200,30,0.5,352,0.2,0.5,4
200,30,0.5,348,0.2,0.5,4
200,30,0.5,364,0.2,0.5,4
200,30,0.5,360,0.2,0.5,4
200,30,0.5,364,0.2,0.5,4
200,30,0.5,363,0.2,0.5,4
200,30,0.5,368,0.2,0.5,4
200,30,0.5,375,0.2,0.5,4
200,30,0.5,381,0.2,0.5,4
200,30,0.5,385,0.2,0.5,4
200,30,0.5,375,0.2,0.5,4
200,30,0.5,372,0.2,0.5,4
200,30,0.5,379,0.2,0.5,4
200,30,0.5,374,0.2,0.5,4
200,30,0.5,379,0.2,0.5,4
200,30,0.5,376,0.2,0.5,4
200,30,0.5,377,0.2,0.5,4
200,30,0.5,382,0.2,0.5,4
200,30,0.5,392,0.2,0.5,4
200,30,0.5,394,0.2,0.5,4
200,30,0.5,389,0.2,0.5,4
200,30,0.5,389,0.2,0.5,4
200,30,0.5,389,0.2,0.5,4
200,30,0.5,391,0.2,0.5,4
200,30,0.5,389,0.2,0.5,4
200,30,0.5,388,0.2,0.5,4
200,30,0.5,389,0.2,0.5,4
200,30,0.5,388,0.2,0.5,4
200,30,0.5,393,0.2,0.5,4
200,30,0.5,395,0.2,0.5,4
200,30,0.5,396,0.2,0.5,4
200,30,0.5,391,0.2,0.5,4
200,30,0.5,396,0.2,0.5,4
200,30,0.5,395,0.2,0.5,4
200,30,0.5,399,0.2,0.5,4
200,30,0.5,398,0.2,0.5,4
200,30,0.5,397,0.2,0.5,4
200,30,0.5,396,0.2,0.5,4
200,30,0.5,396,0.2,0.5,4
200,30,0.5,394,0.2,0.5,4
200,30,0.5,396,0.2,0.5,4
200,30,0.5,397,0.2,0.5,4
200,30,0.5,397,0.2,0.5,4
200,30,0.5,393,0.2,0.5,4
200,30,0.5,395,0.2,0.5,4
200,30,0.5,398,0.2,0.5,4
200,30,0.5,399,0.2,0.5,4
200,30,0.5,398,0.2,0.5,4
200,30,0.5,399,0.2,0.5,4
200,30,0.5,400,0.2,0.5,4
200,30,0.5,399,0.2,0.5,4
200,30,0.5,400,0.2,0.5,4
200,30,0.5,398,0.2,0.5,4
200,30,0.5,397,0.2,0.5,4
200,30,0.5,399,0.2,0.5,4
200,30,0.5,399,0.2,0.5,4
200,30,0.5,398,0.2,0.5,4
200,30,0.5,400,0.2,0.5,4
200,30,0.5,400,0.2,0.5,4
200,30,0.5,400,0.2,0.5,4
200,30,0.5,400,0.2,0.5,4
200,30,0.5,399,0.2,0.5,4
200,30,0.5,399,0.2,0.5,4
200,30,0.5,399,0.2,0.5,4
200,30,0.5,400,0.2,0.5,4
200,30,0.5,400,0.2,0.5,4
200,30,0.5,400,0.2,0.5,4
200,30,0.5,400,0.2,0.5,4
200,30,0.5,399,0.2,0.5,4
200,30,0.5,399,0.2,0.5,4
200,30,0.5,400,0.2,0.5,4
200,30,0.5,399,0.2,0.5,4
200,30,0.5,400,0.2,0.5,4
200,30,0.5,400,0.2,0.5,4
200,30,0.5,399,0.2,0.5,4
200,30,0.5,400,0.2,0.5,4
200,30,0.5,399,0.2,0.5,4
200,30,0.5,400,0.2,0.5,4
200,30,0.5,400,0.2,0.5,4
200,30,0.5,400,0.2,0.5,4
200,30,0.5,400,0.2,0.5,4
200,30,0.5,400,0.2,0.5,4
200,30,0.5,400,0.2,0.5,4
200,30,0.5,400,0.2,0.5,4
200,30,0.5,400,0.2,0.5,4
200,30,0.5,400,0.2,0.5,4
200,30,0.5,400,0.2,0.5,4
200,30,0.5,400,0.2,0.5,4
200,30,0.5,400,0.2,0.5,4
200,30,0.5,400,0.2,0.5,4
200,30,0.5,400,0.2,0.5,4
200,30,0.5,400,0.2,0.5,4
200,30,0.5,400,0.2,0.5,4
200,30,0.5,400,0.2,0.5,4
200,30,0.5,400,0.2,0.5,4
200,30,0.5,400,0.2,0.5,4
200,30,0.5,400,0.2,0.5,4
200,30,0.5,400,0.2,0.5,4
200,30,0.5,400,0.2,0.5,4
200,30,0.5,400,0.2,0.5,4
200,30,0.5,400,0.2,0.5,4
200,30,0.5,400,0.2,0.5,4
200,30,0.5,400,0.2,0.5,4
200,30,0.5,400,0.2,0.5,4
200,30,0.5,400,0.2,0.5,4
200,30,0.5,400,0.2,0.5,4
200,30,0.5,400,0.2,0.5,4
