N,m,b,history,selection_coefficient,dominance_coefficient,nb_simulations
200,30,0.5,1,0.2,0.5,3
200,30,0.5,1,0.2,0.5,3
200,30,0.5,2,0.2,0.5,3
200,30,0.5,1,0.2,0.5,3
200,30,0.5,1,0.2,0.5,3
200,30,0.5,1,0.2,0.5,3
200,30,0.5,2,0.2,0.5,3
200,30,0.5,2,0.2,0.5,3
200,30,0.5,4,0.2,0.5,3
200,30,0.5,4,0.2,0.5,3
200,30,0.5,6,0.2,0.5,3
200,30,0.5,2,0.2,0.5,3
200,30,0.5,3,0.2,0.5,3
200,30,0.5,3,0.2,0.5,3
200,30,0.5,3,0.2,0.5,3
200,30,0.5,4,0.2,0.5,3
200,30,0.5,3,0.2,0.5,3
200,30,0.5,6,0.2,0.5,3
200,30,0.5,9,0.2,0.5,3
200,30,0.5,5,0.2,0.5,3
200,30,0.5,9,0.2,0.5,3
200,30,0.5,10,0.2,0.5,3
200,30,0.5,9,0.2,0.5,3
200,30,0.5,6,0.2,0.5,3
200,30,0.5,11,0.2,0.5,3
200,30,0.5,7,0.2,0.5,3
200,30,0.5,9,0.2,0.5,3
200,30,0.5,10,0.2,0.5,3
200,30,0.5,6,0.2,0.5,3
200,30,0.5,7,0.2,0.5,3
200,30,0.5,11,0.2,0.5,3
200,30,0.5,17,0.2,0.5,3
200,30,0.5,8,0.2,0.5,3
200,30,0.5,14,0.2,0.5,3
200,30,0.5,20,0.2,0.5,3
200,30,0.5,13,0.2,0.5,3
200,30,0.5,17,0.2,0.5,3
200,30,0.5,15,0.2,0.5,3
200,30,0.5,17,0.2,0.5,3
200,30,0.5,13,0.2,0.5,3
200,30,0.5,11,0.2,0.5,3
200,30,0.5,10,0.2,0.5,3
200,30,0.5,22,0.2,0.5,3
200,30,0.5,20,0.2,0.5,3
200,30,0.5,18,0.2,0.5,3
200,30,0.5,20,0.2,0.5,3
200,30,0.5,21,0.2,0.5,3
200,30,0.5,18,0.2,0.5,3
200,30,0.5,19,0.2,0.5,3
200,30,0.5,24,0.2,0.5,3
200,30,0.5,17,0.2,0.5,3
200,30,0.5,20,0.2,0.5,3
200,30,0.5,18,0.2,0.5,3
200,30,0.5,25,0.2,0.5,3
200,30,0.5,26,0.2,0.5,3
200,30,0.5,28,0.2,0.5,3
200,30,0.5,26,0.2,0.5,3
200,30,0.5,40,0.2,0.5,3
200,30,0.5,46,0.2,0.5,3
200,30,0.5,46,0.2,0.5,3
200,30,0.5,53,0.2,0.5,3
200,30,0.5,55,0.2,0.5,3
200,30,0.5,52,0.2,0.5,3
200,30,0.5,60,0.2,0.5,3
200,30,0.5,62,0.2,0.5,3
200,30,0.5,68,0.2,0.5,3
200,30,0.5,84,0.2,0.5,3
200,30,0.5,73,0.2,0.5,3
200,30,0.5,73,0.2,0.5,3
200,30,0.5,68,0.2,0.5,3
200,30,0.5,92,0.2,0.5,3
200,30,0.5,85,0.2,0.5,3
200,30,0.5,88,0.2,0.5,3
200,30,0.5,95,0.2,0.5,3
200,30,0.5,89,0.2,0.5,3
200,30,0.5,105,0.2,0.5,3
200,30,0.5,97,0.2,0.5,3
200,30,0.5,90,0.2,0.5,3
200,30,0.5,94,0.2,0.5,3
200,30,0.5,93,0.2,0.5,3
200,30,0.5,112,0.2,0.5,3
200,30,0.5,102,0.2,0.5,3
200,30,0.5,116,0.2,0.5,3
200,30,0.5,111,0.2,0.5,3
200,30,0.5,127,0.2,0.5,3
200,30,0.5,138,0.2,0.5,3
200,30,0.5,150,0.2,0.5,3
200,30,0.5,157,0.2,0.5,3
200,30,0.5,153,0.2,0.5,3
200,30,0.5,159,0.2,0.5,3
200,30,0.5,165,0.2,0.5,3
200,30,0.5,179,0.2,0.5,3
200,30,0.5,170,0.2,0.5,3
200,30,0.5,189,0.2,0.5,3
200,30,0.5,195,0.2,0.5,3
200,30,0.5,193,0.2,0.5,3
200,30,0.5,200,0.2,0.5,3
200,30,0.5,203,0.2,0.5,3
200,30,0.5,211,0.2,0.5,3
200,30,0.5,234,0.2,0.5,3
200,30,0.5,239,0.2,0.5,3
200,30,0.5,242,0.2,0.5,3
200,30,0.5,252,0.2,0.5,3
200,30,0.5,256,0.2,0.5,3
200,30,0.5,254,0.2,0.5,3
200,30,0.5,260,0.2,0.5,3
200,30,0.5,273,0.2,0.5,3
200,30,0.5,285,0.2,0.5,3
200,30,0.5,297,0.2,0.5,3
200,30,0.5,299,0.2,0.5,3
200,30,0.5,304,0.2,0.5,3
200,30,0.5,305,0.2,0.5,3
200,30,0.5,315,0.2,0.5,3
200,30,0.5,315,0.2,0.5,3
200,30,0.5,318,0.2,0.5,3
200,30,0.5,315,0.2,0.5,3
200,30,0.5,311,0.2,0.5,3
200,30,0.5,321,0.2,0.5,3
200,30,0.5,319,0.2,0.5,3
200,30,0.5,319,0.2,0.5,3
200,30,0.5,331,0.2,0.5,3
200,30,0.5,336,0.2,0.5,3
200,30,0.5,334,0.2,0.5,3
200,30,0.5,339,0.2,0.5,3
200,30,0.5,332,0.2,0.5,3
200,30,0.5,346,0.2,0.5,3
200,30,0.5,348,0.2,0.5,3
200,30,0.5,342,0.2,0.5,3
200,30,0.5,345,0.2,0.5,3
200,30,0.5,347,0.2,0.5,3
200,30,0.5,349,0.2,0.5,3
200,30,0.5,348,0.2,0.5,3
200,30,0.5,360,0.2,0.5,3
200,30,0.5,365,0.2,0.5,3
200,30,0.5,370,0.2,0.5,3
200,30,0.5,366,0.2,0.5,3
200,30,0.5,371,0.2,0.5,3
200,30,0.5,366,0.2,0.5,3
200,30,0.5,371,0.2,0.5,3
200,30,0.5,365,0.2,0.5,3
200,30,0.5,366,0.2,0.5,3
200,30,0.5,377,0.2,0.5,3
200,30,0.5,377,0.2,0.5,3
200,30,0.5,379,0.2,0.5,3
200,30,0.5,381,0.2,0.5,3
200,30,0.5,382,0.2,0.5,3
200,30,0.5,374,0.2,0.5,3
200,30,0.5,370,0.2,0.5,3
200,30,0.5,369,0.2,0.5,3
200,30,0.5,372,0.2,0.5,3
200,30,0.5,379,0.2,0.5,3
200,30,0.5,377,0.2,0.5,3
200,30,0.5,383,0.2,0.5,3
200,30,0.5,384,0.2,0.5,3
200,30,0.5,385,0.2,0.5,3
200,30,0.5,386,0.2,0.5,3
200,30,0.5,376,0.2,0.5,3
200,30,0.5,381,0.2,0.5,3
200,30,0.5,384,0.2,0.5,3
200,30,0.5,387,0.2,0.5,3
200,30,0.5,384,0.2,0.5,3
200,30,0.5,386,0.2,0.5,3
200,30,0.5,388,0.2,0.5,3
200,30,0.5,382,0.2,0.5,3
200,30,0.5,384,0.2,0.5,3
200,30,0.5,386,0.2,0.5,3
200,30,0.5,391,0.2,0.5,3
200,30,0.5,390,0.2,0.5,3
200,30,0.5,394,0.2,0.5,3
200,30,0.5,392,0.2,0.5,3
200,30,0.5,391,0.2,0.5,3
200,30,0.5,390,0.2,0.5,3
200,30,0.5,394,0.2,0.5,3
200,30,0.5,390,0.2,0.5,3
200,30,0.5,394,0.2,0.5,3
200,30,0.5,393,0.2,0.5,3
200,30,0.5,394,0.2,0.5,3
200,30,0.5,392,0.2,0.5,3
200,30,0.5,396,0.2,0.5,3
200,30,0.5,396,0.2,0.5,3
200,30,0.5,398,0.2,0.5,3
200,30,0.5,397,0.2,0.5,3
200,30,0.5,397,0.2,0.5,3
200,30,0.5,395,0.2,0.5,3
200,30,0.5,395,0.2,0.5,3
200,30,0.5,398,0.2,0.5,3
200,30,0.5,397,0.2,0.5,3
200,30,0.5,393,0.2,0.5,3
200,30,0.5,396,0.2,0.5,3
200,30,0.5,395,0.2,0.5,3
200,30,0.5,394,0.2,0.5,3
200,30,0.5,396,0.2,0.5,3
200,30,0.5,396,0.2,0.5,3
200,30,0.5,399,0.2,0.5,3
200,30,0.5,400,0.2,0.5,3
200,30,0.5,399,0.2,0.5,3
200,30,0.5,399,0.2,0.5,3
200,30,0.5,399,0.2,0.5,3
200,30,0.5,400,0.2,0.5,3
200,30,0.5,400,0.2,0.5,3
200,30,0.5,400,0.2,0.5,3
200,30,0.5,400,0.2,0.5,3
200,30,0.5,400,0.2,0.5,3
200,30,0.5,400,0.2,0.5,3
200,30,0.5,400,0.2,0.5,3
200,30,0.5,400,0.2,0.5,3
200,30,0.5,400,0.2,0.5,3
200,30,0.5,400,0.2,0.5,3
200,30,0.5,400,0.2,0.5,3
200,30,0.5,400,0.2,0.5,3
200,30,0.5,400,0.2,0.5,3
200,30,0.5,400,0.2,0.5,3
200,30,0.5,400,0.2,0.5,3
200,30,0.5,400,0.2,0.5,3
200,30,0.5,400,0.2,0.5,3
200,30,0.5,400,0.2,0.5,3
200,30,0.5,400,0.2,0.5,3
200,30,0.5,400,0.2,0.5,3
200,30,0.5,400,0.2,0.5,3
200,30,0.5,400,0.2,0.5,3
200,30,0.5,400,0.2,0.5,3
200,30,0.5,400,0.2,0.5,3
200,30,0.5,400,0.2,0.5,3
200,30,0.5,400,0.2,0.5,3
200,30,0.5,400,0.2,0.5,3
200,30,0.5,400,0.2,0.5,3
200,30,0.5,400,0.2,0.5,3
200,30,0.5,400,0.2,0.5,3
