N,m,b,history,selection_coefficient,dominance_coefficient,nb_simulations
200,30,0.5,1,0.2,0.5,10
200,30,0.5,1,0.2,0.5,10
200,30,0.5,3,0.2,0.5,10
200,30,0.5,2,0.2,0.5,10
200,30,0.5,0,0.2,0.5,10
200,30,0.5,2,0.2,0.5,10
200,30,0.5,6,0.2,0.5,10
200,30,0.5,4,0.2,0.5,10
200,30,0.5,4,0.2,0.5,10
200,30,0.5,3,0.2,0.5,10
200,30,0.5,6,0.2,0.5,10
200,30,0.5,9,0.2,0.5,10
200,30,0.5,6,0.2,0.5,10
200,30,0.5,6,0.2,0.5,10
200,30,0.5,3,0.2,0.5,10
200,30,0.5,5,0.2,0.5,10
200,30,0.5,6,0.2,0.5,10
200,30,0.5,4,0.2,0.5,10
200,30,0.5,4,0.2,0.5,10
200,30,0.5,9,0.2,0.5,10
200,30,0.5,6,0.2,0.5,10
200,30,0.5,3,0.2,0.5,10
200,30,0.5,6,0.2,0.5,10
200,30,0.5,9,0.2,0.5,10
200,30,0.5,6,0.2,0.5,10
200,30,0.5,3,0.2,0.5,10
200,30,0.5,7,0.2,0.5,10
200,30,0.5,10,0.2,0.5,10
200,30,0.5,11,0.2,0.5,10
200,30,0.5,3,0.2,0.5,10
200,30,0.5,4,0.2,0.5,10
200,30,0.5,5,0.2,0.5,10
200,30,0.5,6,0.2,0.5,10
200,30,0.5,6,0.2,0.5,10
200,30,0.5,7,0.2,0.5,10
200,30,0.5,11,0.2,0.5,10
200,30,0.5,6,0.2,0.5,10
200,30,0.5,8,0.2,0.5,10
200,30,0.5,9,0.2,0.5,10
200,30,0.5,8,0.2,0.5,10
200,30,0.5,12,0.2,0.5,10
200,30,0.5,14,0.2,0.5,10
200,30,0.5,11,0.2,0.5,10
200,30,0.5,15,0.2,0.5,10
200,30,0.5,17,0.2,0.5,10
200,30,0.5,16,0.2,0.5,10
200,30,0.5,19,0.2,0.5,10
200,30,0.5,17,0.2,0.5,10
200,30,0.5,17,0.2,0.5,10
200,30,0.5,28,0.2,0.5,10
200,30,0.5,29,0.2,0.5,10
200,30,0.5,31,0.2,0.5,10
200,30,0.5,28,0.2,0.5,10
200,30,0.5,23,0.2,0.5,10
200,30,0.5,22,0.2,0.5,10
200,30,0.5,17,0.2,0.5,10
200,30,0.5,33,0.2,0.5,10
200,30,0.5,30,0.2,0.5,10
200,30,0.5,34,0.2,0.5,10
200,30,0.5,44,0.2,0.5,10
200,30,0.5,42,0.2,0.5,10
200,30,0.5,45,0.2,0.5,10
200,30,0.5,41,0.2,0.5,10
200,30,0.5,73,0.2,0.5,10
200,30,0.5,64,0.2,0.5,10
200,30,0.5,66,0.2,0.5,10
200,30,0.5,71,0.2,0.5,10
200,30,0.5,73,0.2,0.5,10
200,30,0.5,66,0.2,0.5,10
200,30,0.5,62,0.2,0.5,10
200,30,0.5,77,0.2,0.5,10
200,30,0.5,74,0.2,0.5,10
200,30,0.5,69,0.2,0.5,10
200,30,0.5,73,0.2,0.5,10
200,30,0.5,66,0.2,0.5,10
200,30,0.5,72,0.2,0.5,10
200,30,0.5,79,0.2,0.5,10
200,30,0.5,80,0.2,0.5,10
200,30,0.5,95,0.2,0.5,10
200,30,0.5,75,0.2,0.5,10
200,30,0.5,90,0.2,0.5,10
200,30,0.5,94,0.2,0.5,10
200,30,0.5,106,0.2,0.5,10
200,30,0.5,98,0.2,0.5,10
200,30,0.5,112,0.2,0.5,10
200,30,0.5,122,0.2,0.5,10
200,30,0.5,125,0.2,0.5,10
200,30,0.5,149,0.2,0.5,10
200,30,0.5,126,0.2,0.5,10
200,30,0.5,141,0.2,0.5,10
200,30,0.5,141,0.2,0.5,10
200,30,0.5,140,0.2,0.5,10
200,30,0.5,149,0.2,0.5,10
200,30,0.5,160,0.2,0.5,10
200,30,0.5,178,0.2,0.5,10
200,30,0.5,188,0.2,0.5,10
200,30,0.5,169,0.2,0.5,10
200,30,0.5,183,0.2,0.5,10
200,30,0.5,197,0.2,0.5,10
200,30,0.5,194,0.2,0.5,10
200,30,0.5,212,0.2,0.5,10
200,30,0.5,212,0.2,0.5,10
200,30,0.5,219,0.2,0.5,10
200,30,0.5,217,0.2,0.5,10
200,30,0.5,222,0.2,0.5,10
200,30,0.5,228,0.2,0.5,10
200,30,0.5,234,0.2,0.5,10
200,30,0.5,231,0.2,0.5,10
200,30,0.5,236,0.2,0.5,10
200,30,0.5,253,0.2,0.5,10
200,30,0.5,246,0.2,0.5,10
200,30,0.5,274,0.2,0.5,10
200,30,0.5,275,0.2,0.5,10
200,30,0.5,274,0.2,0.5,10
200,30,0.5,258,0.2,0.5,10
200,30,0.5,275,0.2,0.5,10
200,30,0.5,283,0.2,0.5,10
200,30,0.5,276,0.2,0.5,10
200,30,0.5,287,0.2,0.5,10
200,30,0.5,307,0.2,0.5,10
200,30,0.5,309,0.2,0.5,10
200,30,0.5,317,0.2,0.5,10
200,30,0.5,311,0.2,0.5,10
200,30,0.5,322,0.2,0.5,10
200,30,0.5,329,0.2,0.5,10
200,30,0.5,335,0.2,0.5,10
200,30,0.5,335,0.2,0.5,10
200,30,0.5,343,0.2,0.5,10
200,30,0.5,352,0.2,0.5,10
200,30,0.5,347,0.2,0.5,10
200,30,0.5,342,0.2,0.5,10
200,30,0.5,348,0.2,0.5,10
200,30,0.5,346,0.2,0.5,10
200,30,0.5,364,0.2,0.5,10
200,30,0.5,361,0.2,0.5,10
200,30,0.5,356,0.2,0.5,10
200,30,0.5,365,0.2,0.5,10
200,30,0.5,361,0.2,0.5,10
200,30,0.5,357,0.2,0.5,10
200,30,0.5,364,0.2,0.5,10
200,30,0.5,369,0.2,0.5,10
200,30,0.5,358,0.2,0.5,10
200,30,0.5,357,0.2,0.5,10
200,30,0.5,368,0.2,0.5,10
200,30,0.5,372,0.2,0.5,10
200,30,0.5,362,0.2,0.5,10
200,30,0.5,382,0.2,0.5,10
200,30,0.5,381,0.2,0.5,10
200,30,0.5,374,0.2,0.5,10
200,30,0.5,376,0.2,0.5,10
200,30,0.5,383,0.2,0.5,10
200,30,0.5,373,0.2,0.5,10
200,30,0.5,381,0.2,0.5,10
200,30,0.5,381,0.2,0.5,10
200,30,0.5,383,0.2,0.5,10
200,30,0.5,386,0.2,0.5,10
200,30,0.5,390,0.2,0.5,10
200,30,0.5,393,0.2,0.5,10
200,30,0.5,384,0.2,0.5,10
200,30,0.5,383,0.2,0.5,10
200,30,0.5,388,0.2,0.5,10
200,30,0.5,387,0.2,0.5,10
200,30,0.5,385,0.2,0.5,10
200,30,0.5,386,0.2,0.5,10
200,30,0.5,389,0.2,0.5,10
200,30,0.5,388,0.2,0.5,10
200,30,0.5,388,0.2,0.5,10
200,30,0.5,391,0.2,0.5,10
200,30,0.5,390,0.2,0.5,10
200,30,0.5,394,0.2,0.5,10
200,30,0.5,395,0.2,0.5,10
200,30,0.5,394,0.2,0.5,10
200,30,0.5,394,0.2,0.5,10
200,30,0.5,391,0.2,0.5,10
200,30,0.5,394,0.2,0.5,10
200,30,0.5,392,0.2,0.5,10
200,30,0.5,393,0.2,0.5,10
200,30,0.5,388,0.2,0.5,10
200,30,0.5,393,0.2,0.5,10
200,30,0.5,390,0.2,0.5,10
200,30,0.5,390,0.2,0.5,10
200,30,0.5,391,0.2,0.5,10
200,30,0.5,396,0.2,0.5,10
200,30,0.5,390,0.2,0.5,10
200,30,0.5,393,0.2,0.5,10
200,30,0.5,391,0.2,0.5,10
200,30,0.5,394,0.2,0.5,10
200,30,0.5,394,0.2,0.5,10
200,30,0.5,393,0.2,0.5,10
200,30,0.5,397,0.2,0.5,10
200,30,0.5,397,0.2,0.5,10
200,30,0.5,395,0.2,0.5,10
200,30,0.5,395,0.2,0.5,10
200,30,0.5,397,0.2,0.5,10
200,30,0.5,396,0.2,0.5,10
200,30,0.5,398,0.2,0.5,10
200,30,0.5,394,0.2,0.5,10
200,30,0.5,398,0.2,0.5,10
200,30,0.5,395,0.2,0.5,10
200,30,0.5,393,0.2,0.5,10
200,30,0.5,393,0.2,0.5,10
200,30,0.5,393,0.2,0.5,10
200,30,0.5,392,0.2,0.5,10
200,30,0.5,390,0.2,0.5,10
200,30,0.5,392,0.2,0.5,10
200,30,0.5,392,0.2,0.5,10
200,30,0.5,390,0.2,0.5,10
200,30,0.5,394,0.2,0.5,10
200,30,0.5,394,0.2,0.5,10
200,30,0.5,390,0.2,0.5,10
200,30,0.5,397,0.2,0.5,10
200,30,0.5,392,0.2,0.5,10
200,30,0.5,396,0.2,0.5,10
200,30,0.5,394,0.2,0.5,10
200,30,0.5,398,0.2,0.5,10
200,30,0.5,396,0.2,0.5,10
200,30,0.5,397,0.2,0.5,10
200,30,0.5,398,0.2,0.5,10
200,30,0.5,397,0.2,0.5,10
200,30,0.5,399,0.2,0.5,10
200,30,0.5,397,0.2,0.5,10
200,30,0.5,396,0.2,0.5,10
200,30,0.5,397,0.2,0.5,10
200,30,0.5,399,0.2,0.5,10
200,30,0.5,395,0.2,0.5,10
200,30,0.5,397,0.2,0.5,10
200,30,0.5,396,0.2,0.5,10
200,30,0.5,399,0.2,0.5,10
200,30,0.5,398,0.2,0.5,10
200,30,0.5,399,0.2,0.5,10
200,30,0.5,400,0.2,0.5,10
200,30,0.5,400,0.2,0.5,10
200,30,0.5,399,0.2,0.5,10
200,30,0.5,400,0.2,0.5,10
200,30,0.5,400,0.2,0.5,10
200,30,0.5,400,0.2,0.5,10
200,30,0.5,400,0.2,0.5,10
200,30,0.5,400,0.2,0.5,10
200,30,0.5,400,0.2,0.5,10
200,30,0.5,400,0.2,0.5,10
200,30,0.5,400,0.2,0.5,10
200,30,0.5,400,0.2,0.5,10
200,30,0.5,400,0.2,0.5,10
200,30,0.5,400,0.2,0.5,10
200,30,0.5,400,0.2,0.5,10
200,30,0.5,400,0.2,0.5,10
200,30,0.5,400,0.2,0.5,10
200,30,0.5,400,0.2,0.5,10
200,30,0.5,400,0.2,0.5,10
200,30,0.5,400,0.2,0.5,10
200,30,0.5,400,0.2,0.5,10
200,30,0.5,400,0.2,0.5,10
200,30,0.5,400,0.2,0.5,10
200,30,0.5,400,0.2,0.5,10
200,30,0.5,400,0.2,0.5,10
200,30,0.5,400,0.2,0.5,10
200,30,0.5,400,0.2,0.5,10
200,30,0.5,400,0.2,0.5,10
200,30,0.5,400,0.2,0.5,10
200,30,0.5,400,0.2,0.5,10
200,30,0.5,400,0.2,0.5,10
200,30,0.5,400,0.2,0.5,10
200,30,0.5,400,0.2,0.5,10
