{
"type": "FeatureCollection",
"name": "bounding_box",
"crs": { "type": "name", "properties": { "name": "urn:ogc:def:crs:OGC:1.3:CRS84" } },
"features": [
{ "type": "Feature", "properties": { "id": 1 }, "geometry": { "type": "MultiPolygon", "coordinates": [ [ [ [ 12.03568, 48.36607 ], [ 12.03568, 47.90614 ], [ 11.05211, 47.90614 ], [ 11.05211, 48.36607 ], [ 12.03568, 48.36607 ] ] ] ] } }
]
}
