retrun default ReferenceSystem in TraCI

8 jobs for default_Reference_System in 4 minutes and 59 seconds (queued for 1 second)
Name Stage Failure
failed
run_unit_tests_on_windows Unit Test
[ERROR] To see the full stack trace of the errors, re-run Maven with the -e switch.
[ERROR] Re-run Maven using the -X switch to enable full debug logging.
[ERROR]
[ERROR] For more information about the errors and possible solutions, please read the following articles:
[ERROR] [Help 1] http://cwiki.apache.org/confluence/display/MAVEN/MojoFailureException
[ERROR]
[ERROR] After correcting the problems, you can resume the build with the command
[ERROR] mvn <goals> -rf :gui
ERROR: Job failed: exit status 1
failed
run_unit_tests_on_linux Unit Test
[INFO] --- maven-surefire-plugin:2.22.1:test (default-test) @ gui ---
[
INFO]
[
INFO] -------------------------------------------------------
[
INFO] T E S T S
[
INFO] -------------------------------------------------------
[
INFO] Running org.vadere.gui.postvisualization.TestTrajectory
[
INFO] Tests run: 2, Failures: 0, Errors: 0, Skipped: 0, Time elapsed: 0.204 s - in org.vadere.gui.postvisualization.TestTrajectory
[
INFO] Running org.vadere.gui.postvisualization.TestPostVisualisation
[
INFO] Tests run: 1, Failures: 0, Errors: 0, Skipped: 0, Time elapsed: 0.001 s - in org.vadere.gui.postvisualization.TestPostVisualisation
[
INFO] Running org.vadere.gui.topographycreator.model.TopographyBuilderTest